For Watch make Failure I run this command line in daq-2.0.6/ :

‘sudo make check’

 

It return this error :

Makefile:770: recipe for target 'libdaq_static_modules_la-daq_pcap.lo' failed

make[1]: *** [libdaq_static_modules_la-daq_pcap.lo] Error 1

make[1]: Leaving directory '/opt/daq-2.0.6/os-daq-modules'

Makefile:406: recipe for target 'check-recursive' failed

make: *** [check-recursive] Error 1

What should I do for repair this error ?

Thank you in advance to bring your help 😊

Regards.


Dorian ROSSE.

 


De : Snort-users <snort-users-bounces@lists.snort.org> de la part de Dorian ROSSE via Snort-users <snort-users@lists.snort.org>
Envoyé : Tuesday, January 29, 2019 3:52:56 PM
À : snort-users@lists.snort.org; Carter Waxman (cwaxman)
Objet : Re: [Snort-users] Ask for daq static
 
After do this I have be able to builds snort but no scan works,

Regards.


Dorian Rosse.


From: Carter Waxman (cwaxman) <cwaxman@cisco.com>
Sent: Tuesday, January 29, 2019 3:36:37 PM
To: Dorian ROSSE; snort-users@lists.snort.org
Subject: Re: [Snort-users] Ask for daq static
 

If you’re building without static daq, include --disable-static-daq in the configure options.

 

  • Carter

From: Snort-users <snort-users-bounces@lists.snort.org> on behalf of Dorian ROSSE via Snort-users <snort-users@lists.snort.org>
Reply-To: Dorian ROSSE <dorianbrice@hotmail.fr>
Date: Tuesday, January 29, 2019 at 9:32 AM
To: "snort-users@lists.snort.org" <snort-users@lists.snort.org>
Subject: Re: [Snort-users] Ask for daq static

 

The full snort error as daq doesn’t install fully which the static daq missing adviced by the finish error from snort ‘.configure –enable-sourcefire’,

./configure: line 16264: daq-modules-config: command not found

checking for daq_load_modules in -ldaq_static... no

 

   ERROR!  daq_static library not found, go get it from

   http://www.snort.org/.

Thank you in advance to help me repair this daq static error,

Regards.


Dorian ROSSE.

 


De : Dorian ROSSE <dorianbrice@hotmail.fr>
Envoyé : Tuesday, January 29, 2019 3:13:05 PM
À : snort-users@lists.snort.org
Objet : RE: Ask for daq static

 

I install a freshly daq I have the same errors !

Makefile:770: recipe for target 'libdaq_static_modules_la-daq_pcap.lo' failed

make[2]: *** [libdaq_static_modules_la-daq_pcap.lo] Error 1

make[2]: Leaving directory '/opt/daq-2.0.6/os-daq-modules'

Makefile:406: recipe for target 'all-recursive' failed

make[1]: *** [all-recursive] Error 1

make[1]: Leaving directory '/opt/daq-2.0.6'

Makefile:338: recipe for target 'all' failed

make: *** [all] Error 2

Thank you in advance to help me repair this error,

Regards.


Dorian ROSSE.

 

De : Dorian ROSSE
Envoyé le :dimanche 27 janvier 2019 18:30
À : snort-users@lists.snort.org
Objet :Ask for daq static

 

Hello,


My snort ask daq static,

Should I disabled daq static?

Thank you in advance to answer if yes I should disabled daq static,

Regards.


Dorian Rosse.