Hello,


I have the Following error when I want to run make :

/opt/daq-2.0.6# make

cd . && automake-1.15 --foreign

configure.ac:12: error: required file './compile' not found

configure.ac:12:   'automake --add-missing' can install 'compile'

configure.ac:9: error: required file './missing' not found

configure.ac:9:   'automake --add-missing' can install 'missing'

api/Makefile.am: error: required file './depcomp' not found

api/Makefile.am:   'automake --add-missing' can install 'depcomp'

Makefile:344: recipe for target 'Makefile.in' failed

make: *** [Makefile.in] Error 1

Where can I find this files ?

Thank you in advance to help me for repair,

Regards.


Dorian ROSSE.