[Snort-users] daq failure

Dorian ROSSE dorianbrice at hotmail.fr
Mon Jan 14 13:51:47 EST 2019


Hello,


I have the Following error when I want to run make :

/opt/daq-2.0.6# make
cd . && automake-1.15 --foreign
configure.ac:12: error: required file './compile' not found
configure.ac:12:   'automake --add-missing' can install 'compile'
configure.ac:9: error: required file './missing' not found
configure.ac:9:   'automake --add-missing' can install 'missing'
api/Makefile.am: error: required file './depcomp' not found
api/Makefile.am:   'automake --add-missing' can install 'depcomp'
Makefile:344: recipe for target 'Makefile.in' failed
make: *** [Makefile.in] Error 1

Where can I find this files ?

Thank you in advance to help me for repair,

Regards.


Dorian ROSSE.

-------------- next part --------------
An HTML attachment was scrubbed...
URL: <https://lists.snort.org/pipermail/snort-users/attachments/20190114/7a8f1466/attachment.html>


More information about the Snort-users mailing list