[Snort-users] Compiling PostgreSQL for Barnyard2

Michael Steele michaels at ...9077...
Thu Aug 9 17:55:15 EDT 2012


I seem to be having an issue compiling PostgreSQL. The './configure' is
working, but when I use 'make' the following error appears.

spo_database_cache.c: At top level:
../output-plugins/spo_database.h:532: warning: 'FATAL_NO_SENSOR_1' defined
but not used
../output-plugins/spo_database.h:539: warning: 'FATAL_NO_SENSOR_2' defined
but not used
../output-plugins/spo_database.h:548: warning: 'FATAL_BAD_SCHEMA_1' defined
but not used
../output-plugins/spo_database.h:553: warning: 'FATAL_BAD_SCHEMA_2' defined
but not used
../output-plugins/spo_database.h:560: warning: 'FATAL_OLD_SCHEMA_1' defined
but not used
../output-plugins/spo_database.h:568: warning: 'FATAL_OLD_SCHEMA_2' defined
but not used
../output-plugins/spo_database.h:576: warning: 'FATAL_NO_SUPPORT_1' defined
but not used
../output-plugins/spo_database.h:584: warning: 'FATAL_NO_SUPPORT_2' defined
but not used
Makefile:282: recipe for target `spo_database_cache.o' failed
make[3]: *** [spo_database_cache.o] Error 1
make[3]: Leaving directory
`/cygdrive/e/development/cygwin/barnyard2/src/output-plugins'
Makefile:382: recipe for target `all-recursive' failed
make[2]: *** [all-recursive] Error 1
make[2]: Leaving directory `/cygdrive/e/development/cygwin/barnyard2/src'
Makefile:313: recipe for target `all-recursive' failed
make[1]: *** [all-recursive] Error 1
make[1]: Leaving directory `/cygdrive/e/development/cygwin/barnyard2'
Makefile:244: recipe for target `all' failed
make: *** [all] Error 2

Michael at ...2896... /cygdrive/e/development/cygwin/barnyard2
$

Kindest Regards,
Michael





More information about the Snort-users mailing list