[Snort-users] Slackware 13.1 and Barnyard2

James Lay jlay at ...13475...
Sun Jul 17 18:12:43 EDT 2011


Hey all,

Trying to get the beta of barnyard2 to install on Slackware 13.1...getting
an odd error below:

/bin/sh ../libtool --tag=CC   --mode=link gcc  -g -O2 -fno-strict-aliasing
-Wall  -L/usr/lib/mysql -o barnyard2 barnyard2.o debug.o decode.o log.o
log_text.o map.o mstring.o parser.o plugbase.o spooler.o strlcatu.o
strlcpyu.o twofish.o util.o output-plugins/libspo.a input-plugins/libspi.a
sfutil/libsfutil.a -lmysqlclient -lz -lpcap -lnsl -lm -lm
libtool: link: gcc -g -O2 -fno-strict-aliasing -Wall -o barnyard2
barnyard2.o debug.o decode.o log.o log_text.o map.o mstring.o parser.o
plugbase.o spooler.o strlcatu.o strlcpyu.o twofish.o util.o
-L/usr/lib/mysql output-plugins/libspo.a input-plugins/libspi.a
sfutil/libsfutil.a /usr/lib/mysql/libmysqlclient.so -lz -lpcap -lnsl -lm
-Wl,-rpath -Wl,/usr/lib/mysql -Wl,-rpath -Wl,/usr/lib/mysql
/usr/lib/mysql/libmysqlclient.so: could not read symbols: File in wrong
format
collect2: ld returned 1 exit status
make[3]: *** [barnyard2] Error 1
make[3]: Leaving directory `/home/barnyard2/src'
make[2]: *** [all-recursive] Error 1
make[2]: Leaving directory `/home/barnyard2/src'
make[1]: *** [all-recursive] Error 1
make[1]: Leaving directory `/home/barnyard2'
make: *** [all] Error 2

Anyone have any hints to this?  Thanks.

James






More information about the Snort-users mailing list