[Snort-users] Compiling problem in Solairs 2.6

Eswar the MAD snortetm at ...125...
Mon Jan 21 05:49:03 EST 2002


Hi,

I am trying to compile 1.8.3 on Solaris 2.6, its giving errors on make

Attached is the screen dump....

Please help
---------------------------------------------------
Undefined                       first referenced
symbol                             in file
yylex                               /usr/local/lib/libpcap.a(grammar.o)
lex_init                            /usr/local/lib/libpcap.a(gencode.o)
ld: fatal: Symbol referencing errors. No output written to snort
make[2]: *** [snort] Error 1
make[2]: Leaving directory `/home/dumps/snort-1.8.3'
make[1]: *** [all-recursive] Error 1
make[1]: Leaving directory `/home/dumps/snort-1.8.3'
make: *** [all-recursive-am] Error 2
---------------------------

Regards

SnortEtM!!

_________________________________________________________________
Get your FREE download of MSN Explorer at http://explorer.msn.com/intl.asp.





More information about the Snort-users mailing list