[Snort-devel] error compiling daq-0.5

naurin naurin.ramay at ...2499...
Fri Oct 21 02:39:36 EDT 2011


I am trying to install snort-2.9.0.1. It exited with the error that it could not
get package daq. Searching online I found some instructions here,

http://bailey.st/blog/2010/12/21/compiling-snort-2-9-0-3-on-ubuntu/

when following the instructions for compiling daq i got this error, please help.

/usr/lib/gcc/x86_64-linux-gnu/4.4.3/../../../../lib/libipq.a: could not read
symbols: Bad value
collect2: ld returned 1 exit status
make[2]: *** [daq_ipq.la] Error 1
make[2]: Leaving directory `/home/naurin.ramay/daq-0.5/os-daq-modules'
make[1]: *** [all-recursive] Error 1
make[1]: Leaving directory `/home/naurin.ramay/daq-0.5'
make: *** [all] Error 2






More information about the Snort-devel mailing list