[Snort-devel] Compilation Error

Daniel Walther daniel.walther at ...2567...
Fri Jun 18 02:34:17 EDT 2004


Hi list

I try to compile snort-2.0.1 with postgresql-7.4.3. Unfortunatley i 
receive the following error while make:

/usr/local/pgsql/lib/libpq.a(fe-auth.o)(.text+0x1e1): In function 
`pg_password_sendauth':
: undefined reference to `crypt'
collect2: ld returned 1 exit status
make[3]: *** [snort] Error 1
make[3]: Leaving directory 
`/home/daenu/wims/snort-wireless-2.0.1-alpha03/src'
make[2]: *** [all-recursive] Error 1
make[2]: Leaving directory 
`/home/daenu/wims/snort-wireless-2.0.1-alpha03/src'
make[1]: *** [all-recursive] Error 1
make[1]: Leaving directory `/home/daenu/wims/snort-wireless-2.0.1-alpha03'
make: *** [all] Error 2

I hope you have a solution for my problem. Thanks in advance for your help.

Best regards
Daniel




More information about the Snort-devel mailing list